{"text_format":"1","workbook":"xlsx","n_sheets":8,"sheets":["Request Form","Transfer Receipt - BOL","Transfer Receipt - PDF","Trip Cost","Invoice","Approved Invoice PDF","Vehicle Cost Table","Miles-Hrs Conversion Values"],"not_rendered":{"charts":0,"images":7,"macros":1,"external_links":1,"defined_names":8,"comments":0,"pivot_tables":0},"unopened":[],"bounds":{"document_bytes":16777216,"sheet_cells":100000,"rows_first":2000,"rows_last":500,"rows_between":2000,"halvings":0,"cell_chars":16384,"cell_head_chars":4096},"cells_cut":0,"cells_raw":0,"read":"whole","date_system":"1900"}

{"sheet":"Request Form","index":0,"n_rows":59,"n_cols":13,"rows_kept":59,"cut":false,"hidden":false,"merged":[[64,1,64,10],[62,1,62,10],[3,1,3,10],[8,1,8,10],[2,1,2,10],[14,3,14,5],[28,1,28,2],[29,1,29,2],[26,1,27,2],[26,3,26,4],[26,5,27,6],[28,5,28,6],[29,5,29,6],[32,7,32,10],[63,1,63,10],[35,1,35,2],[0,1,0,10],[1,1,1,10],[4,1,4,10],[5,2,5,7],[6,2,6,7],[36,7,36,10],[37,7,37,10],[32,1,32,2],[33,1,33,2],[35,7,35,10],[34,1,34,2],[33,7,33,10],[34,7,34,10],[26,7,27,10],[28,7,28,10],[29,7,29,10],[30,7,30,10],[31,7,31,10],[53,5,53,6],[42,5,42,6],[52,2,52,6],[34,5,34,6],[35,5,35,6],[36,5,36,6],[37,1,37,2],[41,2,41,6],[37,5,37,6],[36,1,36,2],[30,5,30,6],[31,5,31,6],[32,5,32,6],[33,5,33,6],[30,1,30,2],[31,1,31,2]]}
[null,"Department of General Services / Warehouse and Distribution Division"]
[null,"TRANSPORTATION REQUEST",null,null,null,null,null,null,null,null,null,null,"Y"]
[null,"REV:05312232    PLEASE REVIEW the INSTRUCTIONS AND REQUIREMENTS BEFORE COMPLETING THIS FORM",null,null,null,null,null,null,null,null,null,null,"N"]
[null,"MACRO SECURITY MUST BE SET TO MEDIUM and MACRO's ENABLED TO USE THIS FORM"]
[null,"Double Click the Instructions and Requirements Icon to find out how"]
[null,null,"Please complete all the fields in the form below and click the \"Send Request\" button"]
[null,null,"You will get a window asking you to allow this program to access outlook…please answer 'Yes'"]
[]
[null,"If you experience any difficulties with this form, or have questions about scheduling, please contact customer service at 717-525-5812."]
[]
[null,"Requestor Information:"]
[]
[null,"Agency Name -",null,null,null,"Pick Up Date -"]
[null,"Division Name -"]
[null,"Requestor -",null,"Requestor Phone -"]
[]
[null,"Accounting information:"]
[null,null,null,null,"Plant","% Charge","Fund","Cost Ctr","GL Account","Int Ord Y/N","Internal Order Number"]
[null,"Invoice Approval E-Mail -",null,null,null,1,null,null,null,"N"]
[]
[]
[]
[]
[]
[null,"Shipment Information:"]
[]
[null,"Description of Pallet(s) Contents",null,"Number and Description of Packages",null,"Code",null,"Pallet #'s / LPN's"]
[null,null,null,"Number","Size"]
[null,null,null,null,"PALLET"]
[]
[]
[]
[]
[]
[]
[]
[]
[]
[]
[null,"Origin Pick-Up Information:"]
{"$rows_left_out":20}
{"sheet":"Transfer Receipt - BOL","index":1,"n_rows":52,"n_cols":15,"rows_kept":52,"cut":false,"hidden":true,"merged":[[46,1,47,7],[45,9,45,12],[46,11,46,14],[47,8,48,15],[25,9,26,12],[37,1,41,7],[40,9,40,13],[34,13,34,14],[35,13,35,14],[36,13,36,14],[27,9,27,12],[28,9,28,12],[29,9,29,12],[30,9,30,12],[45,2,45,4],[42,8,43,15],[0,1,0,15],[1,1,1,15],[29,13,29,14],[25,13,26,15],[25,8,26,8],[4,4,5,11],[27,13,27,14],[28,13,28,14],[20,13,20,15],[12,2,12,10],[13,2,13,10],[18,7,18,11],[17,1,17,5],[17,13,17,15],[3,12,3,15],[4,12,4,15],[32,13,32,14],[33,13,33,14],[41,9,41,13],[30,13,30,14],[32,9,32,12],[33,9,33,12],[31,13,31,14],[42,1,43,7],[19,7,19,11],[24,1,24,3],[24,4,24,5],[21,1,21,5],[23,1,23,3],[23,7,23,9],[23,10,23,11],[32,1,32,5],[20,7,20,11],[20,1,20,5],[23,4,23,5],[31,9,31,12],[21,7,21,11],[33,1,33,5],[25,6,25,7],[2,5,2,11],[7,11,7,12],[22,1,22,3],[17,7,17,11],[9,1,9,9],[7,1,7,9],[2,12,2,15],[5,12,5,15],[25,1,26,5],[7,13,7,15],[19,1,19,5],[18,1,18,5],[18,13,18,15],[19,13,19,15],[27,1,27,5],[28,1,28,5],[29,1,29,5],[30,1,30,5],[31,1,31,5],[34,1,34,5],[35,1,35,5],[36,1,36,5],[34,9,34,12],[35,9,35,12],[36,9,36,12]]}
[null,"THIS RECEIPT IS BASED ON THE INITIAL REQUEST "]
[null,"THE HARD COPY FOUND ON \"TRANSFER RECEIPT - PDF\" THAT CONTAINS ALL SIGNATURES"]
[null,null,null,null,null,"SHOULD BE USED TO CALCULATE THE INVOICE"]
[]
[null,"COMMONWEALTH OF PENNSYLVANIA",null,null,"BILL OF LADING",null,null,null,null,null,null,null,{"$f":"ROUND(TODAY()+(NOW()*1000),0)","v":44757262}]
[null,null,null,null,null,null,null,null,null,null,null,null,"(FREIGHT BILL #)"]
[null,"RECEIVED FROM (INSERT CONSIGNORS NAME)",null,null,null,null,null,null,null,null,null,"NAME OF STATION",null,"DATE"]
[null,{"$f":"CONCATENATE('Request Form'!C13,\" / \",'Request Form'!C14)","v":" / "},null,null,null,null,null,null,null,null,null,null,null,{"$f":"'Request Form'!G13","v":"00:00:00"}]
[null,"NAME OF TRANSPORTATION COMPANY",null,null,null,null,null,null,null,null,"at"]
[null,{"$f":"CONCATENATE(Invoice!E8,\" / \",Invoice!E9)","v":"Department of General Services / Warehouse and Distribution Division"}]
[]
[null,"The Public property described below in apparent good condition (contents and value unknown) to be forwarded"]
[null,"from",{"$f":"CONCATENATE('Request Form'!C43,\" of \",'Request Form'!C42:G42,,,\",  \",'Request Form'!E48,\".  \",'Request Form'!G48)","v":" of  / ,  .  "}]
[null,"to",{"$f":"CONCATENATE('Request Form'!C54,\"of \",'Request Form'!C53:G53)","v":"of  / "}]
[null,"by said company and its connections, there to be delivered in like good order and condition."]
[]
[null,"(INSERT NAME AND ADDRESS OF CONSIGNOR)",null,null,null,null,null,"(INSERT NAME AND ADDRESS OF CONSIGNEE)",null,null,null,null,null,"VIA (CARRIER IDENTIFICATION)"]
[null,{"$f":"'Request Form'!C42","v":" / "},null,null,null,null,null,{"$f":"'Request Form'!C53","v":" / "},null,null,null,null,null,"DGS/BSSO/W&DD"]
[null,{"$f":"'Request Form'!C45","v":0},null,null,null,null,null,{"$f":"'Request Form'!C56","v":0}]
[null,{"$f":"'Request Form'!C47","v":0},null,null,null,null,null,{"$f":"'Request Form'!C58","v":0}]
[null,{"$f":"'Request Form'!C46","v":0},null,null,null,null,null,{"$f":"'Request Form'!C57","v":0}]
[]
[null,{"$f":"'Request Form'!C48","v":0},null,null,{"$f":"'Request Form'!E48","v":0},{"$f":"'Request Form'!G48","v":0},null,{"$f":"'Request Form'!C59","v":0},null,null,{"$f":"'Request Form'!E59","v":0},{"$f":"'Request Form'!G59","v":0}]
[null,{"$f":"'Request Form'!C43","v":0},null,null,{"$f":"'Request Form'!F43","v":0},null,null,{"$f":"'Request Form'!C54","v":0},null,null,{"$f":"'Request Form'!F54","v":0}]
[null,"CONTACT NAME",null,null,"CONTACT PHONE"]
[null,"MARKS OR NUMBERS",null,null,null,null,"Number and Description of Packages",null,"Code","Contents",null,null,null,"Charges"]
[null,null,null,null,null,null,"Number","Size"]
[null,{"$f":"'Request Form'!H29","v":0},null,null,null,null,{"$f":"'Request Form'!D29","v":0},{"$f":"'Request Form'!E29","v":"PALLET"},{"$f":"'Request Form'!F29","v":0},{"$f":"'Request Form'!B29","v":0}]
[null,{"$f":"'Request Form'!H30","v":0},null,null,null,null,{"$f":"'Request Form'!D30","v":0},{"$f":"'Request Form'!E30","v":0},{"$f":"'Request Form'!F30","v":0},{"$f":"'Request Form'!B30","v":0}]
[null,{"$f":"'Request Form'!H31","v":0},null,null,null,null,{"$f":"'Request Form'!D31","v":0},{"$f":"'Request Form'!E31","v":0},{"$f":"'Request Form'!F31","v":0},{"$f":"'Request Form'!B31","v":0}]
[null,{"$f":"'Request Form'!H32","v":0},null,null,null,null,{"$f":"'Request Form'!D32","v":0},{"$f":"'Request Form'!E32","v":0},{"$f":"'Request Form'!F32","v":0},{"$f":"'Request Form'!B32","v":0}]
[null,{"$f":"'Request Form'!H33","v":0},null,null,null,null,{"$f":"'Request Form'!D33","v":0},{"$f":"'Request Form'!E33","v":0},{"$f":"'Request Form'!F33","v":0},{"$f":"'Request Form'!B33","v":0}]
[null,{"$f":"'Request Form'!H34","v":0},null,null,null,null,{"$f":"'Request Form'!D34","v":0},{"$f":"'Request Form'!E34","v":0},{"$f":"'Request Form'!F34","v":0},{"$f":"'Request Form'!B34","v":0}]
[null,{"$f":"'Request Form'!H35","v":0},null,null,null,null,{"$f":"'Request Form'!D35","v":0},{"$f":"'Request Form'!E35","v":0},{"$f":"'Request Form'!F35","v":0},{"$f":"'Request Form'!B35","v":0}]
[null,{"$f":"'Request Form'!H36","v":0},null,null,null,null,{"$f":"'Request Form'!D36","v":0},{"$f":"'Request Form'!E36","v":0},{"$f":"'Request Form'!F36","v":0},{"$f":"'Request Form'!B36","v":0}]
[null,{"$f":"'Request Form'!H37","v":0},null,null,null,null,{"$f":"'Request Form'!D37","v":0},{"$f":"'Request Form'!E37","v":0},{"$f":"'Request Form'!F37","v":0},{"$f":"'Request Form'!B37","v":0}]
[null,{"$f":"'Request Form'!H38","v":0},null,null,null,null,{"$f":"'Request Form'!D38","v":0},{"$f":"'Request Form'!E38","v":0},{"$f":"'Request Form'!F38","v":0},{"$f":"'Request Form'!B38","v":0}]
[null,"The fibre  boxes used in this shipment conform to the specifications set forth in the box makers certificate thereon and all other requirements of Rule 41 of the consolidated Freight Classification."]
[null,null,null,null,null,null,null,null,null,null,null,null,null,null,"Agent"]
[]
{"$rows_left_out":13}
{"sheet":"Transfer Receipt - PDF","index":2,"n_rows":0,"n_cols":0,"rows_kept":0,"cut":false,"hidden":true,"merged":[]}

{"sheet":"Trip Cost","index":3,"n_rows":26,"n_cols":32,"rows_kept":26,"cut":false,"hidden":true,"merged":[[14,3,14,4],[8,3,8,4],[5,24,5,31],[11,3,11,4],[12,3,12,4],[13,3,13,4],[5,7,5,12],[10,3,10,4],[9,3,9,4],[4,2,5,6],[4,24,4,31],[4,7,4,12],[19,3,19,4],[15,3,15,4],[16,3,16,4],[17,3,17,4],[18,3,18,4]]}
["Date","Agency","Address","Contact","Phone","BOL","Invoice #","Pallets",null,"# Emp","Veh #",null,"Miles","Fuel Cost Alloc","Maint Alloc","Veh cost per trip",null,"Mi/Hr","Calc Hrs/Trip","Min/Trip","Rate Per Pallet","Pallet Surcharge","Markup",null,"Enter Hrs/Trip","Unload time (hrs)","Labor Cost per hour fully burdened","Lobor cost per trip",null,"Sub Cost Per Trip cost per trip",null,"Total Cost Per Trip"]
[{"$f":"'Request Form'!G13","v":"00:00:00"},{"$f":"'Request Form'!C13","v":0},{"$f":"'Request Form'!C46","v":0},{"$f":"'Request Form'!C15","v":0},{"$f":"'Request Form'!G15","v":0},{"$f":"'Transfer Receipt - BOL'!M5","v":44757262},{"$f":"Invoice!K6","v":0},{"$f":"SUM('Transfer Receipt - BOL'!G28:'Transfer Receipt - BOL'!G37)","v":0},null,1,3,null,0,{"$f":"IF(K2>0,SUMIF('Vehicle Cost Table'!$B:$B,K2,'Vehicle Cost Table'!$L:$L),0)","v":1.0276134122287968},{"$f":"SUMIF('Vehicle Cost Table'!$B:$B,K2,'Vehicle Cost Table'!$M:$M)","v":0.18497534516765285},{"$f":"IF(M2>0,IF(K2>0,(N2+O2)*M2,\"Veh # Req\"),\"\")","v":""},null,{"$f":"IF(M2>0,IF(M2>0,VLOOKUP(M2,'Miles-Hrs Conversion Values'!B:F,2),0),\"\")","v":""},{"$f":"IF(M2>0,IF(M2>0,VLOOKUP(M2,'Miles-Hrs Conversion Values'!B:F,3),0),\"\")","v":""},{"$f":"IF(M2>0,VLOOKUP(M2,'Miles-Hrs Conversion Values'!B:F,4),0)","v":0},15,{"$f":"H2*U2","v":0},0.2,null,{"$f":"IF(S2>0,S2,0)","v":""},null,22.62,{"$f":"IF(Y2>0,IF(Y2>8,((((Y2)-8)*J2)*(AA2*1.5))+((8*J2)*AA2),((Y2)*J2)*AA2),\"\")","v":{"$error":"#VALUE!"}},null,{"$f":"IF(AB2>0,P2+AB2+V2,\"\")","v":{"$error":"#VALUE!"}},null,{"$f":"AD2+(AD2*W2)","v":{"$error":"#VALUE!"}}]
[]
[]
[null,null,"Verify Number of Actual Pallets                                              Change here if necessary",null,null,null,null,"Enter Mapquest Miles",null,null,null,null,null,null,null,null,null,null,null,null,null,null,null,null,"Check This Against MapQuest"]
[null,null,null,null,null,null,null,"MAPQUEST",null,null,null,null,null,null,null,null,null,null,null,null,null,null,null,null,"and OVERTYPE If needed"]
[]
[null,null,null,null,null,null,null,"BEFORE Transfer is Completed"]
[null,null,"Address","Miles",null,"Hrs/Trip",null,"1-","Click [Save] … Click [Close]"]
[null,null,"400 North Street",9,null,0.43,null,"2-","Don’t Forget to Click [Save and Close] on the Appointment"]
[null,null,"Kline Plaza",10,null,0.48]
[null,null,"18th and Herr",11,null,0.35,null,"AFTER the Transfer is Complete and Form is signed"]
[null,null,"333 Market Street",12,null,0.42,null,"1-","Put the signed form in this workbook"]
[null,null,"2221 Forster Street",13,null,0.38,null,null,"a.","Scan the Form to PDF and send to yourself"]
[null,null,"ROC",10,null,0.47,null,null,"b.","Open the PDF"]
[null,null,null,null,null,null,null,null,"c.","Click [edit] > [copy to file]"]
[null,null,null,null,null,null,null,null,"d.","Close the PDF"]
[null,null,null,null,null,null,null,null,"e.","Click the [Transfer Receipt - PDF] tab and Click [Paste]"]
[null,null,null,null,null,null,null,"2-","Verify Pallets and Cartons from Transfer receipt (change if needed)"]
[null,null,null,null,null,null,null,"3-","Enter Mapquest Miles and Hours (hours+{[Minutes]/60})"]
[null,null,null,null,null,null,null,"4-","Check the cost values to make sure they look OK"]
[null,null,null,null,null,null,null,"5-","Click Copy To Log Button"]
[null,null,null,null,null,null,null,"6-","WAIT for [Copy Record To Log] button is grey"]
[null,null,null,null,null,null,null,"7-","Click [Send Invoice To Resource Account]"]
[null,null,null,null,null,null,null,"8-","Click [Save] … Click [Close]"]
[null,null,null,null,null,null,null,"9-","Don’t Forget to Click [Save and Close] on the Appointment"]

{"sheet":"Invoice","index":4,"n_rows":43,"n_cols":13,"rows_kept":43,"cut":false,"hidden":true,"merged":[[4,10,4,12],[5,10,5,13],[6,10,6,12],[7,10,7,13],[13,10,13,13],[8,10,8,12],[9,10,9,13],[10,10,10,12],[11,10,11,13],[12,10,12,12],[14,12,14,13],[28,8,28,10],[26,8,26,10],[29,8,29,10],[27,8,27,10],[29,6,29,7],[16,12,16,13],[26,6,26,7],[27,6,27,7],[42,1,42,5],[42,6,42,13],[34,6,34,7],[36,1,36,5],[37,1,37,5],[38,1,38,5],[39,1,39,5],[41,1,41,5],[36,6,36,13],[38,6,38,13],[28,6,28,7],[30,8,30,10],[0,1,0,13],[1,1,1,13],[3,1,3,13],[2,3,2,4],[2,5,2,8],[33,3,33,4],[39,6,39,13],[41,6,41,13],[30,6,30,7],[31,6,31,7],[32,6,32,7],[33,6,33,7],[33,12,33,13],[34,8,34,11],[33,8,33,11],[32,8,32,11],[37,6,37,13],[31,8,31,10]]}
[null,"PLEASE PRINT THIS INVOICE AND SIGN INDICATING APPROVAL"]
[null,"SCAN THE SIGNED COPY INTO A PDF FILE"]
[null,null,null,"AND EMAIL TO : ",null,"GS, WhsDist"]
[]
[null,null,null,null,null,null,null,null,null,null,"INVOICE NO."]
[null,"GENERAL  INVOICE"]
[null,"PAYOR (NAME AND ADDRESS)",null,null,"PAYEE  (NAME AND ADDRESS)",null,null,null,null,null,"DATE"]
[null,{"$f":"IF('Request Form'!$C$13=\"\",\"\",'Request Form'!$C$13)","v":""},null,null,"Department of General Services"]
[null,{"$f":"IF('Request Form'!$C$14=\"\",\"\",'Request Form'!$C$14)","v":""},null,null,"Warehouse and Distribution Division",null,null,null,null,null,"ORDER NO."]
[null,{"$f":"IF('Request Form'!$C$45=\"\",\"\",'Request Form'!$C$45)","v":""},null,null,"905 Elmerton Avenue"]
[null,{"$f":"IF('Request Form'!$C$46=\"\",\"\",'Request Form'!$C$46)","v":""},null,null,"Harrisburg, PA  17110",null,null,null,null,null,"VT OR ADVANCEMENT ACCOUNT NO."]
[null,{"$f":"IF('Request Form'!$C$47=\"\",\"\",'Request Form'!$C$47)","v":""}]
[null,{"$f":"IF('Request Form'!$C$48=\"\",\"\",'Request Form'!$C$48)","v":""},{"$f":"'Request Form'!$E$48","v":0},{"$f":"'Request Form'!$G$48","v":0},"VENDOR NO.",null,null,null,null,null,"TERMS"]
[null,"kclemence@pa.gov","INVOICE E-MAIL",null," ","691147-001"]
[null,"DATE OF TRANSACTION",null,"ITEM AND DESCRIPTION",null,null,null,null,"QUANTITY","UNIT","PALLETS","CARTONS","AMOUNT"]
[]
[null,{"$f":"'Request Form'!$G$13","v":"00:00:00"},"Transportation Services rendered as itemized in ",null,null,null,null,null,1,"Ea.",{"$f":"'Trip Cost'!H2","v":0},null,{"$f":"'Trip Cost'!$AF$2","v":{"$error":"#VALUE!"}}]
[null,null,"Bill of Lading #",null,{"$f":"'Transfer Receipt - BOL'!M5","v":44757262}]
[]
[]
[]
[]
[]
[]
[]
[]
[null,null,"%","FUND","COST CENTER","GL","Int Ord Y/N",null,"Internal Order Number"]
[null,"EXPENDITURE CODING",{"$f":"'Request Form'!F19","v":1},{"$f":"'Request Form'!$G19","v":0},{"$f":"'Request Form'!$H19","v":0},{"$f":"'Request Form'!$I19","v":0},{"$f":"'Request Form'!J19","v":"N"},null,{"$f":"'Request Form'!K19","v":0}]
[null,null,{"$f":"'Request Form'!F20","v":0},{"$f":"'Request Form'!$G20","v":0},{"$f":"'Request Form'!$H20","v":0},{"$f":"'Request Form'!$I20","v":0},{"$f":"'Request Form'!K20","v":0},null,{"$f":"'Request Form'!K20","v":0}]
[null,null,{"$f":"'Request Form'!F21","v":0},{"$f":"'Request Form'!$G21","v":0},{"$f":"'Request Form'!$H21","v":0},{"$f":"'Request Form'!$I21","v":0},{"$f":"'Request Form'!K21","v":0},null,{"$f":"'Request Form'!K21","v":0}]
[null,null,{"$f":"'Request Form'!F22","v":0},{"$f":"'Request Form'!$G22","v":0},{"$f":"'Request Form'!$H22","v":0},{"$f":"'Request Form'!$I22","v":0},{"$f":"'Request Form'!K22","v":0},null,{"$f":"'Request Form'!K22","v":0}]
[null,null,{"$f":"'Request Form'!F23","v":0},{"$f":"'Request Form'!$G23","v":0},{"$f":"'Request Form'!$H23","v":0},{"$f":"'Request Form'!$I23","v":0},{"$f":"'Request Form'!K23","v":0},null,{"$f":"'Request Form'!K23","v":0}]
[null,"REVENUE CODING",1,5000900001,1577330731,4201508]
[null,null,null,"Secondary Cost Element = ",null,9115005,null,null,"TOTAL   ",null,null,null,{"$f":"SUM(M16:M26)","v":{"$error":"#VALUE!"}}]
[]
[]
[null,"I CERTIFY THAT THE ABOVE EXPENSES, SERVICES, MATERIALS OR",null,null,null,null,"ACKNOWLEDGMENT OF THE FOLLOWING IS REQUIRED IF PAYMENT IS"]
[null,"PRODUCTS WERE ACTUALLY INCURRED, RENDERED OR FURNISHED",null,null,null,null,"MADE FROM ADVANCED REQUISITION MONEYS."]
[null,"FOR THE USE OF THE COMMONWEALTH OF PENNSYLVANIA, AND THAT",null,null,null,null,"I HEREBY ACKNOWLEDGE RECEIPT IN FULL AS SET FORTH IN THIS"]
[null,"THE ABOVE PRICES CHARGED WERE FAIR AND REASONABLE.",null,null,null,null,"INVOICE IN THE AMOUNT OF $______________________"]
{"$rows_left_out":4}
{"sheet":"Approved Invoice PDF","index":5,"n_rows":1,"n_cols":1,"rows_kept":1,"cut":false,"hidden":true,"merged":[]}
[" "]

{"sheet":"Vehicle Cost Table","index":6,"n_rows":29,"n_cols":15,"rows_kept":29,"cut":false,"hidden":true,"merged":[]}
[]
[null,"VEH #","Whse","ORG","Year","Make","Model","Equip No","VIN#","Title # ","License",{"$f":"'[1]Vehicle Cost Table'!I2","v":"Maint Alloc (2007 Actual)"},{"$f":"'[1]Vehicle Cost Table'!H2","v":"Fuel Cost Alloc (Cost/Mi)"},null,"2016-08-10"]
[null,1,"Elmerton",7330,2002,"FORD / Blue","WINDSTAR CARGO","057-00-5281","2FTZA54452BA75132","57009884402","PA91276",0.30751981248656779,0.14978539551096065]
[null,2,"Elmerton",7330,1996,"Ford / Green","F700","057-03-3961","1FDNF70J1TVA18354","49255459201","PA75957",1.0909153993185408,0.49652995564644781]
[null,3,"Elmerton",7330,2015,"Hino","268A-16 Box Truck","085-03-0015","5PVNJ8JT8G4S56934",75719046800,"PA9861A",1.0276134122287968,0.18497534516765285]
[null,4,"Elmerton",7330,2003,"GMC / Blue","SAVANA 3500","059-01-1116","1GTHG35U531140099","58391119101","PA91223",0.20306630163075823,0.18155882094975587]
[null,5,"Elmerton",7330,1995,"Mack","CH613","068-04-0127","1M1AA13YOSW050762","48118694001","PA74576",1.7687885586090857,0.69081550748414844]
[null,6,"Elmerton",7330,2002,"Sterling","M8500 Acterra Truck","077-04-0006","2FZAANCSX2AK17965","57125590801","PA86972",0.34771711711711711,0.34629902569421478]
[null,7,"Federal",7320,2005,"Dodge","Caravan","006-05-6164","1D4GP24R35B320006","72253573300","35391PA",0.11849334466156895,0.1040750392356124]
[null,8,"Federal",7320,2001,"International","box truck","065-02-2663","1HTSCABM21H366697","70891113600","PA4041A",0.11539179954441914,0.29715774487471525]
[null,9,"Federal",7320,1995,"Mack","CH613","068-04-0128","1M1AA13Y2SW050763","48118694001","PA74577",0.28344685039370082,0.9556751901634668]
[null,10,"Federal",7320,2010,"Mack","Tractor","068-04-0161","1M1AW07Y6ANO11684","67669430000","PA98622",0.1872198309546125,0.52262113608153227]
[null,11,"Forster",7330,2001,"Chevy","Box Truck","053-02-6868","1GBG6HIESIJ511641",56647192101,"PA86833",0.80295840961186926,0.46118778715883224]
[null,12,"Forster",7330,2015,"Hino","268A-16 Box Truck","085-03-0016","5PVNJ8JT1G4S56936",75719047000,"PA9862A",1.0280470914127424,0.19107340720221608]
[null,13,"Forster",7330,2003,"Ford Blue","E350 passenger van","057-10-6328","1FBSS31L93HBO5319",68677769601,"31520PA",0.15054442344045368,0.2147865438402542]
[null,14,"Recycle",7340,2004,"Sterling","box truck","077-04-0010","2FZACHC574AM51673",59488583301,"PA88954",0.20436984770798444,0.26046590166607841]
[null,15,"Recycle",7340,2000,"Sterling","Compactor","086-04-0009","2FZHAJBB4YAG51349",54606980001,"PA86805",0.88780524858834875,0.58147711376902944]
[null,16,"Recycle",7340,2007,"Sterling","Compactor","077-04-0026","2FZHCHDJ17AX82578",64761263201,"PA96981",0.71574273657112208,0.65495456270141406]
[null,17,"State",7310,2003,"Daimler","Sterling","077-04-0007","LEASED",58175567001,"87654PA",0.42217567710755427,0.34404250207503073]
[null,18,"State",7310,2013,"Ford","E-350","057-01-6572","1FTSE2EL7DDA10568",71354356801,"PA5849A",2.0760380190095049E-2,0.13124678217023464]
[null,19]
[null,20]
[]
[null,null,null,null,"CY2007 Actual"]
[null,null,null,null,"Cost","Location","Miles",null,null,null,null,null,"CPM"]
[null,null,null,null,3353.58,"Elmerton",20362,null,null,null,null,null,0.16469796680090365]
[null,null,null,null,6630.74,"Bobali",11230,null,null,null,null,null,0.5904487978628673]
[null,null,null,null,1644.02,"Forster",13604,null,null,null,null,null,0.12084827991767128]
[null,null,null,"Total",11628.34,null,45196,null,null,null,null,null,0.25728692804672981]

{"sheet":"Miles-Hrs Conversion Values","index":7,"n_rows":232,"n_cols":7,"rows_kept":232,"cut":false,"hidden":true,"merged":[]}
[null,"Miles","MPH","Hrs","Min"]
[null,1,4,0.25,15,null,0.32659861234108267]
[null,2,23.939185610743277,8.3545030834401179E-2,5.0127018500640705,null,0.33807317101190304]
[null,3,24.277258781755179,0.12357243570903305,7.4143461425419828,null,0.34954772968272341]
[null,4,24.626806511437902,0.16242463261089915,9.7454779566539482,null,0.36102228835354377]
[null,5,24.987828799791444,0.20009741702895498,12.005845021737299,null,0.37249684702436414]
[null,6,25.360325646815809,0.23659002189324599,14.195401313594759,null,0.38397140569518451]
[null,7,25.744297052510994,0.27190487997097007,16.314292798258204,null,0.39544596436600488]
[null,8,26.139743016876999,0.30604738519559427,18.362843111735657,null,0.40692052303682524]
[null,9,26.546663539913823,0.33902565520025485,20.341539312015293,null,0.41839508170764561]
[null,10,26.96505862162147,0.37085029705745465,22.251017823447278,null,0.42986964037846598]
[null,11,27.394928261999937,0.4015341779616311,24.092050677697866,null,0.44134419904928635]
[null,12,27.836272461049223,0.43109220233389284,25.865532140033569,null,0.45281875772010671]
[null,13,28.289091218769329,0.45954109658265452,27.572465794959271,null,0.46429331639092708]
[null,14,28.753384535160254,0.48689920252276736,29.213952151366041,null,0.47576787506174745]
[null,15,29.229152410222003,0.51318628024103119,30.79117681446187,null,0.48724243373256781]
[null,16,29.716394843954571,0.53842332099901413,32.305399259940849,null,0.49871699240338818]
[null,17,30.215111836357959,0.56263237058562976,33.757942235137783,null,0.51019155107420855]
[null,18,30.725303387432167,0.58583636337217404,35.150181802330444,null,0.52166610974502892]
[null,19,31.246969497177197,0.60805896718132713,36.483538030879629,null,0.53314066841584928]
[null,20,31.780110165593047,0.62932443895846324,37.759466337507796,null,0.54461522708666965]
[null,21,32.324725392679717,0.649657491127695,38.979449467661702,null,0.55608978575749002]
[null,22,32.88081517843721,0.66908316842543791,40.144990105526276,null,0.56756434442831039]
[null,23,33.448379522865523,0.68762673492977611,41.257604095786569,null,0.57903890309913075]
[null,24,34.027418425964655,0.70531357094333014,42.318814256599808,null,0.59051346176995112]
[null,25,34.617931887734606,0.72216907933941854,43.330144760365116,null,0.60198802044077149]
[null,26,35.219919908175378,0.73821860094476777,44.293116056686067,null,0.61346257911159185]
[null,27,35.833382487286968,0.75348733850562688,45.209240310337613,null,0.62493713778241222]
[null,28,36.458319625069379,0.76800028876664705,46.080017325998824,null,0.63641169645323259]
[null,29,37.094731321522609,0.78178218218213669,46.906930930928198,null,0.64788625512405296]
[null,30,37.742617576646659,0.7948574297762161,47.691445786572963,null,0.65936081379487332]
[null,31,38.401978390441535,0.8072500766709475,48.435004600256853,null,0.67083537246569369]
[null,32,39.072813762907231,0.81898376180878929,49.139025708527356,null,0.68230993113651406]
[null,33,39.755123694043746,0.8300816834068655,49.804901004411931,null,0.69378448980733443]
[null,34,40.448908183851081,0.84056656969480925,50.433994181688554,null,0.70525904847815479]
[null,35,41.154167232329236,0.85046065450463681,51.027639270278208,null,0.71673360714897516]
[null,36,41.87090083947821,0.85978565729966816,51.587139437980092,null,0.72820816581979553]
[null,37,42.599109005298004,0.86856276724938897,52.113766034963341,null,0.73968272449061589]
[null,38,43.338791729788618,0.87681263097791817,52.608757858675091,null,0.75115728316143626]
[null,39,44.089949012950051,0.88455534363500765,53.07332061810046,null,0.76263184183225663]
{"$rows_left_out":192}